Reaction Details
TargetHistamine H4 receptor
LigandBDBM50415489
Substrate/Competitorn/a
Meas. Tech.ChEMBL_613512 (CHEMBL1072278)
IC50 10±n/a nM
Citation Smits, RAAdami, MIstyastono, EPZuiderveld, OPvan Dam, CMde Kanter, FJJongejan, ACoruzzi, GLeurs, Rde Esch, IJ Synthesis and QSAR of quinazoline sulfonamides as highly potent human histamine H4 receptor inverse agonists. J Med Chem53:2390-400 (2010) 
 
Histamine H4 receptor
Name:Histamine H4 receptor
Type:G Protein-Coupled Receptor (GPCR)
Mol. Mass.:44517.02
Organism:Homo sapiens (Human)
Description:Binding assays were using CHO cells stably expressing hH4R receptors.
Residue:390
BDBM50415489
NameBDBM50415489
Synonyms:CHEMBL591969
TypeSmall organic molecule
Emp. Form.C15H21ClN6O2S
Mol. Mass.384.884
SMILESCN1CCN(CC1)c1nc(NCCS(N)(=O)=O)c2cc(Cl)ccc2n1