Reaction Details
TargetHistamine H4 receptor
LigandBDBM50361015
Substrate/Competitorn/a
Meas. Tech.ChEMBL_613516 (CHEMBL1074193)
Ki 1.55±n/a nM
Citation Smits, RAAdami, MIstyastono, EPZuiderveld, OPvan Dam, CMde Kanter, FJJongejan, ACoruzzi, GLeurs, Rde Esch, IJ Synthesis and QSAR of quinazoline sulfonamides as highly potent human histamine H4 receptor inverse agonists. J Med Chem53:2390-400 (2010) 
 
Histamine H4 receptor
Name:Histamine H4 receptor
Type:G Protein-Coupled Receptor (GPCR)
Mol. Mass.:44045.07
Organism:Rattus norvegicus (rat)
Description:Cell pellets from SK-N-MC cells transfected with rat H4 receptor were used in binding assay.
Residue:391
BDBM50361015
NameBDBM50361015
Synonyms:CHEMBL592379
TypeSmall organic molecule
Emp. Form.C21H25ClN6O2S
Mol. Mass.460.98
SMILESCN1CCN(CC1)c1nc(NCCS(=O)(=O)Nc2ccccc2)c2cc(Cl)ccc2n1