Reaction Details
TargetFalcipain-2
LigandBDBM50415532
Substrate/Competitorn/a
Meas. Tech.ChEMBL_612226 (CHEMBL1074166)
IC50>100000±n/a nM
Citation Hans, RHGuantai, EMLategan, CSmith, PJWan, BFranzblau, SGGut, JRosenthal, PJChibale, K Synthesis, antimalarial and antitubercular activity of acetylenic chalcones. Bioorg Med Chem Lett20:942-4 (2010) 
 
Falcipain-2
Name:Falcipain-2
Synonyms:n/a
Type:Enzyme
Mol. Mass.:55912.57
Organism:Plasmodium falciparum
Description:n/a
Residue:484
BDBM50415532
NameBDBM50415532
Synonyms:CHEMBL592303
TypeSmall organic molecule
Emp. Form.C21H20O5
Mol. Mass.352.3805
SMILESCOc1ccc(\C=C\C(=O)c2ccc(OCC#C)cc2)c(OC)c1OC