Reaction Details
TargetFalcipain-2
LigandBDBM50415539
Substrate/Competitorn/a
Meas. Tech.ChEMBL_612226 (CHEMBL1074166)
IC50>100000±n/a nM
Citation Hans, RHGuantai, EMLategan, CSmith, PJWan, BFranzblau, SGGut, JRosenthal, PJChibale, K Synthesis, antimalarial and antitubercular activity of acetylenic chalcones. Bioorg Med Chem Lett20:942-4 (2010) 
 
Falcipain-2
Name:Falcipain-2
Synonyms:n/a
Type:Enzyme
Mol. Mass.:55912.57
Organism:Plasmodium falciparum
Description:n/a
Residue:484
BDBM50415539
NameBDBM50415539
Synonyms:CHEMBL597220
TypeSmall organic molecule
Emp. Form.C20H18O4
Mol. Mass.322.3545
SMILESCOc1ccc(\C=C\C(=O)c2ccccc2OCC#C)c(OC)c1