Reaction Details
TargetFalcipain-2
LigandBDBM50415542
Substrate/Competitorn/a
Meas. Tech.ChEMBL_612226 (CHEMBL1074166)
IC50>100000±n/a nM
Citation Hans, RHGuantai, EMLategan, CSmith, PJWan, BFranzblau, SGGut, JRosenthal, PJChibale, K Synthesis, antimalarial and antitubercular activity of acetylenic chalcones. Bioorg Med Chem Lett20:942-4 (2010) 
 
Falcipain-2
Name:Falcipain-2
Synonyms:n/a
Type:Enzyme
Mol. Mass.:55912.57
Organism:Plasmodium falciparum
Description:n/a
Residue:484
BDBM50415542
NameBDBM50415542
Synonyms:CHEMBL602103
TypeSmall organic molecule
Emp. Form.C20H18O4
Mol. Mass.322.3545
SMILESCOc1ccc(C(=O)\C=C\c2ccc(OCC#C)cc2)c(OC)c1