Reaction Details
TargetFalcipain-2
LigandBDBM50415546
Substrate/Competitorn/a
Meas. Tech.ChEMBL_612226 (CHEMBL1074166)
IC50>100000±n/a nM
Citation Hans, RHGuantai, EMLategan, CSmith, PJWan, BFranzblau, SGGut, JRosenthal, PJChibale, K Synthesis, antimalarial and antitubercular activity of acetylenic chalcones. Bioorg Med Chem Lett20:942-4 (2010) 
 
Falcipain-2
Name:Falcipain-2
Synonyms:n/a
Type:Enzyme
Mol. Mass.:55912.57
Organism:Plasmodium falciparum
Description:n/a
Residue:484
BDBM50415546
NameBDBM50415546
Synonyms:CHEMBL597624
TypeSmall organic molecule
Emp. Form.C19H16O3
Mol. Mass.292.3285
SMILESCOc1ccc(cc1)C(=O)\C=C\c1cccc(OCC#C)c1