Reaction Details
TargetFalcipain-2
LigandBDBM50415547
Substrate/Competitorn/a
Meas. Tech.ChEMBL_612226 (CHEMBL1074166)
IC50>100000±n/a nM
Citation Hans, RHGuantai, EMLategan, CSmith, PJWan, BFranzblau, SGGut, JRosenthal, PJChibale, K Synthesis, antimalarial and antitubercular activity of acetylenic chalcones. Bioorg Med Chem Lett20:942-4 (2010) 
 
Falcipain-2
Name:Falcipain-2
Synonyms:n/a
Type:Enzyme
Mol. Mass.:55912.57
Organism:Plasmodium falciparum
Description:n/a
Residue:484
BDBM50415547
NameBDBM50415547
Synonyms:CHEMBL597896
TypeSmall organic molecule
Emp. Form.C21H20O5
Mol. Mass.352.3805
SMILESCOc1ccc(C(=O)\C=C\c2ccccc2OCC#C)c(OC)c1OC