Reaction Details
TargetP2X purinoceptor 3
LigandBDBM50415563
Substrate/Competitorn/a
Meas. Tech.ChEMBL_612711 (CHEMBL1069583)
IC50 251.19±n/a nM
Citation Brotherton-Pleiss, CEDillon, MPFord, APGever, JRCarter, DSGleason, SKLin, CJMoore, AGThompson, AWVilla, MZhai, Y Discovery and optimization of RO-85, a novel drug-like, potent, and selective P2X3 receptor antagonist. Bioorg Med Chem Lett20:1031-6 (2010) 
 
P2X purinoceptor 3
Name:P2X purinoceptor 3
Type:Enzyme Catalytic Domain
Mol. Mass.:44397.63
Organism:RAT
Description:Purinergic, P2X3 0 RAT::P49654
Residue:397
BDBM50415563
NameBDBM50415563
Synonyms:CHEMBL605325
TypeSmall organic molecule
Emp. Form.C24H30N6O2
Mol. Mass.434.534
SMILESCCCc1nc(oc1C(=O)NC(C)CN1CCN(CC1)c1ncccn1)-c1ccccc1