Reaction Details
TargetP2X purinoceptor 3
LigandBDBM50415550
Substrate/Competitorn/a
Meas. Tech.ChEMBL_612716 (CHEMBL1069588)
IC50 398.11±n/a nM
Citation Brotherton-Pleiss, CEDillon, MPFord, APGever, JRCarter, DSGleason, SKLin, CJMoore, AGThompson, AWVilla, MZhai, Y Discovery and optimization of RO-85, a novel drug-like, potent, and selective P2X3 receptor antagonist. Bioorg Med Chem Lett20:1031-6 (2010) 
 
P2X purinoceptor 3
Name:P2X purinoceptor 3
Type:Protein
Mol. Mass.:44292.02
Organism:Homo sapiens (Human)
Description:P56373
Residue:397
BDBM50415550
NameBDBM50415550
Synonyms:CHEMBL599760 | Ro-85
TypeSmall organic molecule
Emp. Form.C22H27N5O2S
Mol. Mass.425.547
SMILESC[C@H](CN1CCN(CC1)C(C)=O)NC(=O)c1cc2c(nn(C)c2s1)-c1ccccc1