Reaction Details
TargetMitogen-activated protein kinase 14
LigandBDBM50415611
Substrate/Competitorn/a
Meas. Tech.ChEMBL_621743 (CHEMBL1108475)
IC50>15848.93±n/a nM
Citation Christopher, JAAtkinson, FLBax, BDBrown, MJChampigny, ACChuang, TTJones, EJMosley, JEMusgrave, JR 1-Aryl-3,4-dihydroisoquinoline inhibitors of JNK3. Bioorg Med Chem Lett19:2230-4 (2009) 
 
Mitogen-activated protein kinase 14
Name:Mitogen-activated protein kinase 14
Type:Serine/threonine-protein kinase
Mol. Mass.:41286.76
Organism:Homo sapiens (Human)
Description:Q16539
Residue:360
BDBM50415611
NameBDBM50415611
Synonyms:CHEMBL1086784
TypeSmall organic molecule
Emp. Form.C17H16ClNO2
Mol. Mass.301.767
SMILESCOc1cc2CCN=C(c3ccc(Cl)cc3)c2cc1OC