Reaction Details
TargetMitogen-activated protein kinase 10
LigandBDBM50415613
Substrate/Competitorn/a
Meas. Tech.ChEMBL_621741 (CHEMBL1108473)
IC50 10000±n/a nM
Citation Christopher, JAAtkinson, FLBax, BDBrown, MJChampigny, ACChuang, TTJones, EJMosley, JEMusgrave, JR 1-Aryl-3,4-dihydroisoquinoline inhibitors of JNK3. Bioorg Med Chem Lett19:2230-4 (2009) 
 
Mitogen-activated protein kinase 10
Name:Mitogen-activated protein kinase 10
Type:Enzyme
Mol. Mass.:52586.89
Organism:Homo sapiens (Human)
Description:n/a
Residue:464
BDBM50415613
NameBDBM50415613
Synonyms:CHEMBL1077137
TypeSmall organic molecule
Emp. Form.C16H13BrClNO
Mol. Mass.350.638
SMILESCOc1cc2C(=NCCc2cc1Cl)c1cccc(Br)c1