Reaction Details
TargetMitogen-activated protein kinase 10
LigandBDBM50415614
Substrate/Competitorn/a
Meas. Tech.ChEMBL_621741 (CHEMBL1108473)
IC50 1000±n/a nM
Citation Christopher, JAAtkinson, FLBax, BDBrown, MJChampigny, ACChuang, TTJones, EJMosley, JEMusgrave, JR 1-Aryl-3,4-dihydroisoquinoline inhibitors of JNK3. Bioorg Med Chem Lett19:2230-4 (2009) 
 
Mitogen-activated protein kinase 10
Name:Mitogen-activated protein kinase 10
Type:Enzyme
Mol. Mass.:52586.89
Organism:Homo sapiens (Human)
Description:n/a
Residue:464
BDBM50415614
NameBDBM50415614
Synonyms:CHEMBL1088053
TypeSmall organic molecule
Emp. Form.C20H16ClNO
Mol. Mass.321.8
SMILESCOc1cc2CCN=C(c3ccc4ccccc4c3)c2cc1Cl