Reaction Details
TargetMitogen-activated protein kinase 14
LigandBDBM50415616
Substrate/Competitorn/a
Meas. Tech.ChEMBL_621743 (CHEMBL1108475)
IC50 7943.28±n/a nM
Citation Christopher, JAAtkinson, FLBax, BDBrown, MJChampigny, ACChuang, TTJones, EJMosley, JEMusgrave, JR 1-Aryl-3,4-dihydroisoquinoline inhibitors of JNK3. Bioorg Med Chem Lett19:2230-4 (2009) 
 
Mitogen-activated protein kinase 14
Name:Mitogen-activated protein kinase 14
Type:Serine/threonine-protein kinase
Mol. Mass.:41286.76
Organism:Homo sapiens (Human)
Description:Q16539
Residue:360
BDBM50415616
NameBDBM50415616
Synonyms:CHEMBL1087421
TypeSmall organic molecule
Emp. Form.C16H12Cl3NO
Mol. Mass.340.632
SMILESCOc1cc2CCN=C(c3ccc(Cl)c(Cl)c3)c2cc1Cl