Reaction Details
TargetMitogen-activated protein kinase 10
LigandBDBM50415625
Substrate/Competitorn/a
Meas. Tech.ChEMBL_621739 (CHEMBL1108471)
IC50 10000±n/a nM
Citation Christopher, JAAtkinson, FLBax, BDBrown, MJChampigny, ACChuang, TTJones, EJMosley, JEMusgrave, JR 1-Aryl-3,4-dihydroisoquinoline inhibitors of JNK3. Bioorg Med Chem Lett19:2230-4 (2009) 
 
Mitogen-activated protein kinase 10
Name:Mitogen-activated protein kinase 10
Type:Enzyme
Mol. Mass.:52586.89
Organism:Homo sapiens (Human)
Description:n/a
Residue:464
BDBM50415625
NameBDBM50415625
Synonyms:CHEMBL1077118
TypeSmall organic molecule
Emp. Form.C17H16ClNO2
Mol. Mass.301.767
SMILESCOc1cc2CCN=C(c3cccc(Cl)c3)c2cc1OC