Reaction Details
TargetMitogen-activated protein kinase 8
LigandBDBM50415620
Substrate/Competitorn/a
Meas. Tech.ChEMBL_621744 (CHEMBL1108476)
IC50>100000±n/a nM
Citation Christopher, JAAtkinson, FLBax, BDBrown, MJChampigny, ACChuang, TTJones, EJMosley, JEMusgrave, JR 1-Aryl-3,4-dihydroisoquinoline inhibitors of JNK3. Bioorg Med Chem Lett19:2230-4 (2009) 
 
Mitogen-activated protein kinase 8
Name:Mitogen-activated protein kinase 8
Type:Enzyme
Mol. Mass.:48297.57
Organism:Homo sapiens (Human)
Description:JNK-1 was purchased from Upstate Cell Signaling Solutions (formerly Upstate Biotechnology).
Residue:427
BDBM50415620
NameBDBM50415620
Synonyms:CHEMBL1088633
TypeSmall organic molecule
Emp. Form.C16H13Cl2NO
Mol. Mass.306.187
SMILESCOc1cc2CCN=C(c3cccc(Cl)c3)c2cc1Cl