Reaction Details
TargetTyrosine-protein kinase Lck
LigandBDBM50415620
Substrate/Competitorn/a
Meas. Tech.ChEMBL_621759 (CHEMBL1108491)
IC50>10000±n/a nM
Citation Christopher, JAAtkinson, FLBax, BDBrown, MJChampigny, ACChuang, TTJones, EJMosley, JEMusgrave, JR 1-Aryl-3,4-dihydroisoquinoline inhibitors of JNK3. Bioorg Med Chem Lett19:2230-4 (2009) 
 
Tyrosine-protein kinase Lck
Name:Tyrosine-protein kinase Lck
Type:n/a
Mol. Mass.:57987.83
Organism:Homo sapiens (Human)
Description:P06239
Residue:509
BDBM50415620
NameBDBM50415620
Synonyms:CHEMBL1088633
TypeSmall organic molecule
Emp. Form.C16H13Cl2NO
Mol. Mass.306.187
SMILESCOc1cc2CCN=C(c3cccc(Cl)c3)c2cc1Cl