Reaction Details
TargetAminopeptidase N
LigandBDBM50415631
Substrate/Competitorn/a
Meas. Tech.ChEMBL_619203 (CHEMBL1100889)
Ki 54.95±n/a nM
Citation Lukaszuk, ADemaegdt, HFeytens, DVanderheyden, PVauquelin, GTourwé, D The replacement of His(4) in angiotensin IV by conformationally constrained residues provides highly potent and selective analogues. J Med Chem52:5612-8 (2009) 
 
Aminopeptidase N
Name:Aminopeptidase N
Type:PROTEIN
Mol. Mass.:109522.63
Organism:Homo sapiens (Human)
Description:ChEMBL_1507526
Residue:967
BDBM50415631
NameBDBM50415631
Synonyms:CHEMBL1077585
TypeSmall organic molecule
Emp. Form.C45H57N7O8
Mol. Mass.823.9762
SMILESCCCC[C@@H](N)CC(=O)N[C@@H](Cc1ccc(O)cc1)C(=O)N[C@@H]([C@@H](C)CC)C(=O)N[C@H]1Cc2c(CN(CC(=O)N[C@@H](Cc3ccccc3)C(O)=O)C1=O)[nH]c1ccccc21