Reaction Details
TargetAlpha-1D adrenergic receptor
LigandBDBM50415772
Substrate/Competitorn/a
Meas. Tech.ChEMBL_615925 (CHEMBL1099771)
Ki 6.76±n/a nM
Citation Franchini, SPrandi, ASorbi, CTait, ABaraldi, AAngeli, PBuccioni, MCilia, APoggesi, EFossa, PBrasili, L Discovery of a new series of 5-HT1A receptor agonists. Bioorg Med Chem Lett20:2017-20 (2010) 
 
Alpha-1D adrenergic receptor
Name:Alpha-1D adrenergic receptor
Type:Enzyme Catalytic Domain
Mol. Mass.:60485.82
Organism:Homo sapiens (Human)
Description:adrenergic Alpha1D ADRA1D HUMAN::P25100
Residue:572
BDBM50415772
NameBDBM50415772
Synonyms:CHEMBL1078953
TypeSmall organic molecule
Emp. Form.C26H29NO4
Mol. Mass.419.5128
SMILESCCOc1ccccc1OCCNCC1COC(O1)(c1ccccc1)c1ccccc1