Reaction Details
TargetAlpha-1D adrenergic receptor
LigandBDBM50415776
Substrate/Competitorn/a
Meas. Tech.ChEMBL_615925 (CHEMBL1099771)
Ki 6.61±n/a nM
Citation Franchini, SPrandi, ASorbi, CTait, ABaraldi, AAngeli, PBuccioni, MCilia, APoggesi, EFossa, PBrasili, L Discovery of a new series of 5-HT1A receptor agonists. Bioorg Med Chem Lett20:2017-20 (2010) 
 
Alpha-1D adrenergic receptor
Name:Alpha-1D adrenergic receptor
Type:Enzyme Catalytic Domain
Mol. Mass.:60485.82
Organism:Homo sapiens (Human)
Description:adrenergic Alpha1D ADRA1D HUMAN::P25100
Residue:572
BDBM50415776
NameBDBM50415776
Synonyms:CHEMBL1083182
TypeSmall organic molecule
Emp. Form.C25H27NO3S
Mol. Mass.421.552
SMILESCOc1ccccc1OCCNCC1CSC(O1)(c1ccccc1)c1ccccc1