Reaction Details
TargetOxysterols receptor LXR-beta
LigandBDBM50415818
Substrate/Competitorn/a
Meas. Tech.ChEMBL_625549 (CHEMBL1109729)
EC50 16±n/a nM
Citation Zuercher, WJBuckholz, RGCampobasso, NCollins, JLGalardi, CMGampe, RTHyatt, SMMerrihew, SLMoore, JTOplinger, JAReid, PRSpearing, PKStanley, TBStewart, ELWillson, TM Discovery of tertiary sulfonamides as potent liver X receptor antagonists. J Med Chem53:3412-6 (2010) 
 
Oxysterols receptor LXR-beta
Name:Oxysterols receptor LXR-beta
Type:Enzyme Catalytic Domain
Mol. Mass.:50978.79
Organism:Homo sapiens (Human)
Description:P55055
Residue:460
BDBM50415818
NameBDBM50415818
Synonyms:CHEMBL1093523
TypeSmall organic molecule
Emp. Form.C30H29ClFNO4S2
Mol. Mass.586.137
SMILESCc1cc(C)c(c(C)c1)S(=O)(=O)N(Cc1ccc(cc1)-c1cccc(c1)S(C)(=O)=O)Cc1c(F)cccc1Cl