Reaction Details
TargetOxysterols receptor LXR-beta
LigandBDBM50415825
Substrate/Competitorn/a
Meas. Tech.ChEMBL_625549 (CHEMBL1109729)
EC50 3.2±n/a nM
Citation Zuercher, WJBuckholz, RGCampobasso, NCollins, JLGalardi, CMGampe, RTHyatt, SMMerrihew, SLMoore, JTOplinger, JAReid, PRSpearing, PKStanley, TBStewart, ELWillson, TM Discovery of tertiary sulfonamides as potent liver X receptor antagonists. J Med Chem53:3412-6 (2010) 
 
Oxysterols receptor LXR-beta
Name:Oxysterols receptor LXR-beta
Type:Enzyme Catalytic Domain
Mol. Mass.:50978.79
Organism:Homo sapiens (Human)
Description:P55055
Residue:460
BDBM50415825
NameBDBM50415825
Synonyms:CHEMBL1091034
TypeSmall organic molecule
Emp. Form.C27H23ClFNO4S2
Mol. Mass.544.057
SMILESCS(=O)(=O)c1cccc(c1)-c1ccc(CN(Cc2ccc(F)cc2Cl)S(=O)(=O)c2ccccc2)cc1