Reaction Details
TargetThymidylate synthase
LigandBDBM50006687
Substrate/Competitorn/a
Meas. Tech.ChEMBL_628669 (CHEMBL1106435)
IC50 40±n/a nM
Citation Srivastava, VGupta, SPSiddiqi, MIMishra, BN 3D-QSAR studies on quinazoline antifolate thymidylate synthase inhibitors by CoMFA and CoMSIA models. Eur J Med Chem45:1560-71 (2010) 
 
Thymidylate synthase
Name:Thymidylate synthase
Type:Enzyme
Mol. Mass.:35718.07
Organism:Homo sapiens (Human)
Description:n/a
Residue:313
BDBM50006687
NameBDBM50006687
Synonyms:(S)-2-(4-(((2-methyl-4-oxo-3,4-dihydroquinazolin-6-yl)methyl)(prop-2-ynyl)amino)benzamido)pentanedioic acid 2-{4-[(2-Methyl-4-oxo-3,4-dihydro-quinazolin-6-ylmethyl)-prop-2-ynyl-amino]-benzoylamino}-pentanedioic acid 2-{4-[1-(2-Methyl-4-oxo-3,4-dihydro-quinazolin-6-ylmethyl)-prop-2-ynyl]-benzoylamino}-pentanedioic acid | CHEMBL434209
TypeSmall organic molecule
Emp. Form.C25H24N4O6
Mol. Mass.476.4813
SMILESCc1nc2ccc(CN(CC#C)c3ccc(cc3)C(=O)N[C@@H](CCC(O)=O)C(O)=O)cc2c(=O)[nH]1