Reaction Details
TargetThymidylate synthase
LigandBDBM50014498
Substrate/Competitorn/a
Meas. Tech.ChEMBL_628669 (CHEMBL1106435)
IC50 8.9±n/a nM
Citation Srivastava, VGupta, SPSiddiqi, MIMishra, BN 3D-QSAR studies on quinazoline antifolate thymidylate synthase inhibitors by CoMFA and CoMSIA models. Eur J Med Chem45:1560-71 (2010) 
 
Thymidylate synthase
Name:Thymidylate synthase
Type:Enzyme
Mol. Mass.:35718.07
Organism:Homo sapiens (Human)
Description:n/a
Residue:313
BDBM50014498
NameBDBM50014498
Synonyms:(S)-2-(4-(((2-amino-4-oxo-3,4-dihydroquinazolin-6-yl)methyl)(prop-2-ynyl)amino)-2-fluorobenzamido)pentanedioic acid CHEMBL104230
TypeSmall organic molecule
Emp. Form.C24H22FN5O6
Mol. Mass.495.4598
SMILESNc1nc2ccc(CN(CC#C)c3ccc(C(=O)N[C@@H](CCC(O)=O)C(O)=O)c(F)c3)cc2c(=O)[nH]1