Reaction Details
TargetCarbonic anhydrase 2
LigandBDBM10861
Substrate/Competitorn/a
Meas. Tech.ChEMBL_632192 (CHEMBL1106525)
Ki 6250000±n/a nM
Citation Sethi, KKVerma, SMPrasanthi, NSahoo, SKParhi, RNSuresh, P 3D-QSAR study of benzene sulfonamide analogs as carbonic anhydrase II inhibitors. Bioorg Med Chem Lett20:3089-93 (2010) 
 
Carbonic anhydrase 2
Name:Carbonic anhydrase 2
Type:Enzyme
Mol. Mass.:29250.71
Organism:Homo sapiens (Human)
Description:P00918
Residue:260
BDBM10861
NameBDBM10861
Synonyms:4-(2-aminoethyl)benzene-1-sulfonamide aromatic sulfonamide compound 7 | aromatic/heteroaromatic sulfonamide 6
TypeSmall organic molecule
Emp. Form.C8H12N2O2S
Mol. Mass.200.258
SMILESNCCc1ccc(cc1)S(N)(=O)=O