Reaction Details
TargetCarbonic anhydrase 2
LigandBDBM10864
Substrate/Competitorn/a
Meas. Tech.ChEMBL_632192 (CHEMBL1106525)
Ki 25000000±n/a nM
Citation Sethi, KKVerma, SMPrasanthi, NSahoo, SKParhi, RNSuresh, P 3D-QSAR study of benzene sulfonamide analogs as carbonic anhydrase II inhibitors. Bioorg Med Chem Lett20:3089-93 (2010) 
 
Carbonic anhydrase 2
Name:Carbonic anhydrase 2
Type:Enzyme
Mol. Mass.:29250.71
Organism:Homo sapiens (Human)
Description:P00918
Residue:260
BDBM10864
NameBDBM10864
Synonyms:4-Amino-3-bromobenzenesulfonamide CHEMBL6724 halogenosulfanilamide deriv. 5d
TypeSmall organic molecule
Emp. Form.C6H7BrN2O2S
Mol. Mass.251.101
SMILESNc1ccc(cc1Br)S(N)(=O)=O