Reaction Details
TargetHistamine H2 receptor
LigandBDBM50415917
Substrate/Competitorn/a
Meas. Tech.ChEMBL_629740 (CHEMBL1121100)
EC50 25.12±n/a nM
Citation Ghorai, PKraus, ABirnkammer, TGeyer, RBernhardt, GDove, SSeifert, RElz, SBuschauer, A Chiral NG-acylated hetarylpropylguanidine-type histamine H2 receptor agonists do not show significant stereoselectivity. Bioorg Med Chem Lett20:3173-6 (2010) 
 
Histamine H2 receptor
Name:Histamine H2 receptor
Type:G Protein-Coupled Receptor (GPCR)
Mol. Mass.:40567.22
Organism:Cavia porcellus (domestic guinea pig)
Description:For the H2 receptor-binding assays, guinea pig striatum was used.
Residue:359
BDBM50415917
NameBDBM50415917
Synonyms:CHEMBL1096429
TypeSmall organic molecule
Emp. Form.C17H23N5O
Mol. Mass.313.3974
SMILESC[C@@H](CC(=O)NC(N)=NCCCc1cnc[nH]1)c1ccccc1