Reaction Details
TargetHistamine H1 receptor
LigandBDBM50415918
Substrate/Competitorn/a
Meas. Tech.ChEMBL_629747 (CHEMBL1121259)
EC50 6165.95±n/a nM
Citation Ghorai, PKraus, ABirnkammer, TGeyer, RBernhardt, GDove, SSeifert, RElz, SBuschauer, A Chiral NG-acylated hetarylpropylguanidine-type histamine H2 receptor agonists do not show significant stereoselectivity. Bioorg Med Chem Lett20:3173-6 (2010) 
 
Histamine H1 receptor
Name:Histamine H1 receptor
Type:G Protein-Coupled Receptor (GPCR)
Mol. Mass.:55808.72
Organism:Homo sapiens (Human)
Description:Cell pellets from SK-N-MC cells transfected with human H1 receptor were used in binding assay.
Residue:487
BDBM50415918
NameBDBM50415918
Synonyms:CHEMBL1096428
TypeSmall organic molecule
Emp. Form.C17H23N5O
Mol. Mass.313.3974
SMILESC[C@H](CC(=O)NC(N)=NCCCc1cnc[nH]1)c1ccccc1