Reaction Details
TargetHistamine H1 receptor
LigandBDBM50415919
Substrate/Competitorn/a
Meas. Tech.ChEMBL_629747 (CHEMBL1121259)
EC50>10000±n/a nM
Citation Ghorai, PKraus, ABirnkammer, TGeyer, RBernhardt, GDove, SSeifert, RElz, SBuschauer, A Chiral NG-acylated hetarylpropylguanidine-type histamine H2 receptor agonists do not show significant stereoselectivity. Bioorg Med Chem Lett20:3173-6 (2010) 
 
Histamine H1 receptor
Name:Histamine H1 receptor
Type:G Protein-Coupled Receptor (GPCR)
Mol. Mass.:55808.72
Organism:Homo sapiens (Human)
Description:Cell pellets from SK-N-MC cells transfected with human H1 receptor were used in binding assay.
Residue:487
BDBM50415919
NameBDBM50415919
Synonyms:CHEMBL1094144
TypeSmall organic molecule
Emp. Form.C18H31N5OS
Mol. Mass.365.537
SMILESC[C@@H](CC(=O)NC(N)=NCCCc1sc(N)nc1C)C1CCCCC1