Reaction Details
TargetHistamine H3 receptor
LigandBDBM50415914
Substrate/Competitorn/a
Meas. Tech.ChEMBL_629749 (CHEMBL1121261)
EC50>10000±n/a nM
Citation Ghorai, PKraus, ABirnkammer, TGeyer, RBernhardt, GDove, SSeifert, RElz, SBuschauer, A Chiral NG-acylated hetarylpropylguanidine-type histamine H2 receptor agonists do not show significant stereoselectivity. Bioorg Med Chem Lett20:3173-6 (2010) 
 
Histamine H3 receptor
Name:Histamine H3 receptor
Type:G Protein-Coupled Receptor (GPCR)
Mol. Mass.:48691.47
Organism:Homo sapiens (Human)
Description:Binding assays were using CHO cells stably expressing hH3R receptors.
Residue:445
BDBM50415914
NameBDBM50415914
Synonyms:CHEMBL1098441
TypeSmall organic molecule
Emp. Form.C18H25N5OS
Mol. Mass.359.489
SMILESC[C@H](CC(=O)NC(N)=NCCCc1sc(N)nc1C)c1ccccc1