Reaction Details
TargetHistamine H4 receptor
LigandBDBM50415921
Substrate/Competitorn/a
Meas. Tech.ChEMBL_629751 (CHEMBL1121263)
EC50>10000±n/a nM
Citation Ghorai, PKraus, ABirnkammer, TGeyer, RBernhardt, GDove, SSeifert, RElz, SBuschauer, A Chiral NG-acylated hetarylpropylguanidine-type histamine H2 receptor agonists do not show significant stereoselectivity. Bioorg Med Chem Lett20:3173-6 (2010) 
 
Histamine H4 receptor
Name:Histamine H4 receptor
Type:G Protein-Coupled Receptor (GPCR)
Mol. Mass.:44517.02
Organism:Homo sapiens (Human)
Description:Binding assays were using CHO cells stably expressing hH4R receptors.
Residue:390
BDBM50415921
NameBDBM50415921
Synonyms:CHEMBL1094452
TypeSmall organic molecule
Emp. Form.C18H31N5OS
Mol. Mass.365.537
SMILESC[C@H](CC(=O)NC(N)=NCCCc1sc(N)nc1C)C1CCCCC1