Reaction Details
TargetSubstance-K receptor
LigandBDBM50415927
Substrate/Competitorn/a
Meas. Tech.ChEMBL_633592 (CHEMBL1120420)
Ki 0.501±n/a nM
Citation Fattori, DPorcelloni, MD'Andrea, PCatalioto, RMEttorre, AGiuliani, SMarastoni, EMauro, SMeini, SRossi, CAltamura, MMaggi, CA Structure-activity relationships of 6-methyl-benzo[b]thiophene-2-carboxylic acid (1-[(S)-1-benzyl-4-[4-(tetrahydropyran-4-ylmethyl)piperazin-1-yl]butylcarbamoyl]cyclopentyl)amide, potent antagonist of the neurokinin-2 receptor. J Med Chem53:4148-65 (2010) 
 
Substance-K receptor
Name:Substance-K receptor
Type:Protein
Mol. Mass.:44455.78
Organism:Homo sapiens (Human)
Description:P21452
Residue:398
BDBM50415927
NameBDBM50415927
Synonyms:CHEMBL1084159
TypeSmall organic molecule
Emp. Form.C35H47N5O5S2
Mol. Mass.681.908
SMILESCc1ccc2cc(sc2c1)C(=O)NC1(CCCC1)C(=O)N[C@@H](CCCN1CCN(CC1)S(=O)(=O)N1CCOCC1)Cc1ccccc1