Reaction Details
TargetSubstance-K receptor
LigandBDBM50415941
Substrate/Competitorn/a
Meas. Tech.ChEMBL_633592 (CHEMBL1120420)
Ki 0.251±n/a nM
Citation Fattori, DPorcelloni, MD'Andrea, PCatalioto, RMEttorre, AGiuliani, SMarastoni, EMauro, SMeini, SRossi, CAltamura, MMaggi, CA Structure-activity relationships of 6-methyl-benzo[b]thiophene-2-carboxylic acid (1-[(S)-1-benzyl-4-[4-(tetrahydropyran-4-ylmethyl)piperazin-1-yl]butylcarbamoyl]cyclopentyl)amide, potent antagonist of the neurokinin-2 receptor. J Med Chem53:4148-65 (2010) 
 
Substance-K receptor
Name:Substance-K receptor
Type:Protein
Mol. Mass.:44455.78
Organism:Homo sapiens (Human)
Description:P21452
Residue:398
BDBM50415941
NameBDBM50415941
Synonyms:CHEMBL1083872
TypeSmall organic molecule
Emp. Form.C37H45N5O2S
Mol. Mass.623.851
SMILESCc1ccc2cc(sc2c1)C(=O)NC1(CCCC1)C(=O)N[C@@H](CCCN1CCN(Cc2ccncc2)CC1)Cc1ccccc1