Reaction Details
Target5-hydroxytryptamine receptor 6
LigandBDBM50416003
Substrate/Competitorn/a
Meas. Tech.ChEMBL_635521 (CHEMBL1118104)
Ki 0.2±n/a nM
Citation Harris, RNStabler, RSRepke, DBKress, JMWalker, KAMartin, RSBrothers, JMIlnicka, MLee, SWMirzadegan, T Highly potent, non-basic 5-HT6 ligands. Site mutagenesis evidence for a second binding mode at 5-HT6 for antagonism. Bioorg Med Chem Lett20:3436-40 (2010) 
 
5-hydroxytryptamine receptor 6
Name:5-hydroxytryptamine receptor 6
Type:G Protein-Coupled Receptor (GPCR)
Mol. Mass.:46968.43
Organism:Homo sapiens (Human)
Description:P50406
Residue:440
BDBM50416003
NameBDBM50416003
Synonyms:CHEMBL1082508
TypeSmall organic molecule
Emp. Form.C18H19FN2O3S
Mol. Mass.362.418
SMILESNC(=O)NC[C@@H]1CCCc2cc(ccc12)S(=O)(=O)c1cccc(F)c1