Reaction Details
Target5-hydroxytryptamine receptor 6
LigandBDBM50416131
Substrate/Competitorn/a
Meas. Tech.ChEMBL_634948 (CHEMBL1117802)
Ki 19.95±n/a nM
Citation Reid, MCarlyle, ICaulfield, WLClarkson, TRCusick, FEpemolu, OGilfillan, RGoodwin, RJaap, DO'Donnell, ECPresland, JRankovic, ZSpinks, DSpinks, GThomson, AMThomson, FStrain, JWishart, G The discovery and SAR of indoline-3-carboxamides--a new series of 5-HT6 antagonists. Bioorg Med Chem Lett20:3713-6 (2010) 
 
5-hydroxytryptamine receptor 6
Name:5-hydroxytryptamine receptor 6
Type:G Protein-Coupled Receptor (GPCR)
Mol. Mass.:46968.43
Organism:Homo sapiens (Human)
Description:P50406
Residue:440
BDBM50416131
NameBDBM50416131
Synonyms:CHEMBL1085965
TypeSmall organic molecule
Emp. Form.C23H26F3N3O4S
Mol. Mass.497.53
SMILESCN(C1CCN(C)CC1)C(=O)C1CN(c2ccccc12)S(=O)(=O)c1ccc(OC(F)(F)F)cc1