Reaction Details
TargetPotassium voltage-gated channel subfamily H member 2
LigandBDBM50416137
Substrate/Competitorn/a
Meas. Tech.ChEMBL_634949 (CHEMBL1117803)
Ki 1258.93±n/a nM
Citation Reid, MCarlyle, ICaulfield, WLClarkson, TRCusick, FEpemolu, OGilfillan, RGoodwin, RJaap, DO'Donnell, ECPresland, JRankovic, ZSpinks, DSpinks, GThomson, AMThomson, FStrain, JWishart, G The discovery and SAR of indoline-3-carboxamides--a new series of 5-HT6 antagonists. Bioorg Med Chem Lett20:3713-6 (2010) 
 
Potassium voltage-gated channel subfamily H member 2
Name:Potassium voltage-gated channel subfamily H member 2
Type:Multi-pass membrane protein
Mol. Mass.:126672.65
Organism:Homo sapiens (Human)
Description:Q12809
Residue:1159
BDBM50416137
NameBDBM50416137
Synonyms:CHEMBL1084215
TypeSmall organic molecule
Emp. Form.C25H27N3O4S
Mol. Mass.465.565
SMILESCOc1ccc(c2ccccc12)S(=O)(=O)N1C[C@H](C(=O)N2CCCNCC2)c2ccccc12