Reaction Details
TargetMuscarinic acetylcholine receptor M3
LigandBDBM50416151
Substrate/Competitorn/a
Meas. Tech.ChEMBL_635228 (CHEMBL1117839)
IC50 2±n/a nM
Citation Budzik, BGarzya, VShi, DWalker, GLauchart, YLucas, AJRivero, RALangmead, CJWatson, JWu, ZForbes, ITJin, J 2' biaryl amides as novel and subtype selective M1 agonists. Part II: Further optimization and profiling. Bioorg Med Chem Lett20:3545-9 (2010) 
 
Muscarinic acetylcholine receptor M3
Name:Muscarinic acetylcholine receptor M3
Type:Enzyme
Mol. Mass.:66151.03
Organism:Homo sapiens (Human)
Description:P20309
Residue:590
BDBM50416151
NameBDBM50416151
Synonyms:CHEMBL1084850
TypeSmall organic molecule
Emp. Form.C20H24ClNO
Mol. Mass.329.864
SMILESOC(CCC1CCNCC1)c1ccccc1-c1cccc(Cl)c1