Reaction Details
TargetC-C chemokine receptor type 2
LigandBDBM50416289
Substrate/Competitorn/a
Meas. Tech.ChEMBL_640105 (CHEMBL1174375)
Ki 5.01±n/a nM
Citation Peace, SPhilp, JBrooks, CPiercy, VMoores, KSmethurst, CWatson, SGaines, SZippoli, MMookherjee, CIfe, R Identification of a sulfonamide series of CCR2 antagonists. Bioorg Med Chem Lett20:3961-4 (2010) 
 
C-C chemokine receptor type 2
Name:C-C chemokine receptor type 2
Type:Enzyme
Mol. Mass.:41932.32
Organism:Homo sapiens (Human)
Description:P41597
Residue:374
BDBM50416289
NameBDBM50416289
Synonyms:CHEMBL1171787
TypeSmall organic molecule
Emp. Form.C17H11Cl2NO5S2
Mol. Mass.444.309
SMILESOC(=O)c1ccccc1Oc1ccc(Cl)cc1NS(=O)(=O)c1ccc(Cl)s1