Reaction Details
TargetAdenosine receptor A2b
LigandBDBM50416330
Substrate/Competitorn/a
Meas. Tech.ChEMBL_640438 (CHEMBL1174864)
Ki 2.34±n/a nM
Citation Nieto, MIBalo, MCBrea, JCaamaño, OFernández, FGarcía-Mera, XLópez, CLoza, MIRodríguez-Borges, JEVidal, B Synthesis and pharmacological evaluation of novel substituted 9-deazaxanthines as A2B receptor antagonists. Eur J Med Chem45:2884-92 (2010) 
 
Adenosine receptor A2b
Name:Adenosine receptor A2b
Type:G Protein-Coupled Receptor (GPCR)
Mol. Mass.:36341.22
Organism:Homo sapiens (Human)
Description:n/a
Residue:332
BDBM50416330
NameBDBM50416330
Synonyms:CHEMBL1170166
TypeSmall organic molecule
Emp. Form.C23H21FN4O4
Mol. Mass.436.4356
SMILESCCCn1c(=O)[nH]c2cc([nH]c2c1=O)-c1ccc(OCC(=O)Nc2ccc(F)cc2)cc1