Reaction Details
TargetP2X purinoceptor 7
LigandBDBM50416395
Substrate/Competitorn/a
Meas. Tech.ChEMBL_643414 (CHEMBL1212278)
IC50 10±n/a nM
Citation Beswick, PJBillinton, AChambers, LJDean, DKFonfria, EGleave, RJMedhurst, SJMichel, ADMoses, APPatel, SRoman, SARoomans, SSenger, SStevens, AJWalter, DS Structure-activity relationships and in vivo activity of (1H-pyrazol-4-yl)acetamide antagonists of the P2X(7) receptor. Bioorg Med Chem Lett20:4653-6 (2010) 
 
P2X purinoceptor 7
Name:P2X purinoceptor 7
Type:Protein
Mol. Mass.:68602.85
Organism:Homo sapiens (Human)
Description:Q99572
Residue:595
BDBM50416395
NameBDBM50416395
Synonyms:CHEMBL1210369
TypeSmall organic molecule
Emp. Form.C17H21ClFN3O
Mol. Mass.337.82
SMILESCCc1n[nH]c(CC)c1CCC(=O)NCc1ccc(F)cc1Cl