Reaction Details
TargetAcetylcholine receptor subunit alpha
LigandBDBM50416396
Substrate/Competitorn/a
Meas. Tech.ChEMBL_643569 (CHEMBL1212433)
IC50 1000±n/a nM
Citation Capelli, AMCastelletti, LSalvagno, COliosi, BDi Lenarda, EVirginio, CLightfoot, AKew, JNTeague, S Identification of novel alpha7 nAChR positive allosteric modulators with the use of pharmacophore in silico screening methods. Bioorg Med Chem Lett20:4561-5 (2010) 
 
Acetylcholine receptor subunit alpha
Name:Acetylcholine receptor subunit alpha
Type:Ion channel
Mol. Mass.:54542.01
Organism:Homo sapiens (Human)
Description:n/a
Residue:482
BDBM50416396
NameBDBM50416396
Synonyms:CHEMBL1210703
TypeSmall organic molecule
Emp. Form.C23H24N2O2S
Mol. Mass.392.514
SMILESCc1ccc(NC(=O)c2cc(c(s2)N2CCOCC2)-c2ccccc2)c(C)c1