Reaction Details
TargetNeuronal acetylcholine receptor subunit alpha-7
LigandBDBM50416398
Substrate/Competitorn/a
Meas. Tech.ChEMBL_643567 (CHEMBL1212431)
EC50 25.12±n/a nM
Citation Capelli, AMCastelletti, LSalvagno, COliosi, BDi Lenarda, EVirginio, CLightfoot, AKew, JNTeague, S Identification of novel alpha7 nAChR positive allosteric modulators with the use of pharmacophore in silico screening methods. Bioorg Med Chem Lett20:4561-5 (2010) 
 
Neuronal acetylcholine receptor subunit alpha-7
Name:Neuronal acetylcholine receptor subunit alpha-7
Type:n/a
Mol. Mass.:56448.33
Organism:Homo sapiens (Human)
Description: CHRNA7 (NACHRA7)
Residue:502
BDBM50416398
NameBDBM50416398
Synonyms:CHEMBL1210643
TypeSmall organic molecule
Emp. Form.C26H21N3O3
Mol. Mass.423.4632
SMILESO=C(Cc1nc(-c2ccc3OCOc3c2)c2ccccc2n1)NC1Cc2ccccc2C1