Reaction Details
TargetNeuronal acetylcholine receptor subunit alpha-7
LigandBDBM50416401
Substrate/Competitorn/a
Meas. Tech.ChEMBL_643567 (CHEMBL1212431)
EC50 31.62±n/a nM
Citation Capelli, AMCastelletti, LSalvagno, COliosi, BDi Lenarda, EVirginio, CLightfoot, AKew, JNTeague, S Identification of novel alpha7 nAChR positive allosteric modulators with the use of pharmacophore in silico screening methods. Bioorg Med Chem Lett20:4561-5 (2010) 
 
Neuronal acetylcholine receptor subunit alpha-7
Name:Neuronal acetylcholine receptor subunit alpha-7
Type:n/a
Mol. Mass.:56448.33
Organism:Homo sapiens (Human)
Description: CHRNA7 (NACHRA7)
Residue:502
BDBM50416401
NameBDBM50416401
Synonyms:CHEMBL1210640
TypeSmall organic molecule
Emp. Form.C24H25F2N3O3
Mol. Mass.441.4704
SMILESFC1(F)CCC(CC1)c1nn(CC(=O)NCCOc2ccccc2)c(=O)c2ccccc12