Reaction Details
TargetNeuronal acetylcholine receptor subunit alpha-7
LigandBDBM50416410
Substrate/Competitorn/a
Meas. Tech.ChEMBL_643567 (CHEMBL1212431)
EC50 1258.93±n/a nM
Citation Capelli, AMCastelletti, LSalvagno, COliosi, BDi Lenarda, EVirginio, CLightfoot, AKew, JNTeague, S Identification of novel alpha7 nAChR positive allosteric modulators with the use of pharmacophore in silico screening methods. Bioorg Med Chem Lett20:4561-5 (2010) 
 
Neuronal acetylcholine receptor subunit alpha-7
Name:Neuronal acetylcholine receptor subunit alpha-7
Type:n/a
Mol. Mass.:56448.33
Organism:Homo sapiens (Human)
Description: CHRNA7 (NACHRA7)
Residue:502
BDBM50416410
NameBDBM50416410
Synonyms:CHEMBL1210458
TypeSmall organic molecule
Emp. Form.C22H22N2O2S
Mol. Mass.378.487
SMILESCc1ccc(NC(=O)c2cc(c(s2)N2CCOCC2)-c2ccccc2)cc1