Reaction Details
TargetCannabinoid receptor 1
LigandBDBM50416464
Substrate/Competitorn/a
Meas. Tech.ChEMBL_644193 (CHEMBL1212092)
EC50>10000±n/a nM
Citation Kiyoi, TYork, MFrancis, SEdwards, DWalker, GHoughton, AKCottney, JEBaker, JAdam, JM Design, synthesis, and structure-activity relationship study of conformationally constrained analogs of indole-3-carboxamides as novel CB1 cannabinoid receptor agonists. Bioorg Med Chem Lett20:4918-21 (2010) 
 
Cannabinoid receptor 1
Name:Cannabinoid receptor 1
Type:G Protein-Coupled Receptor (GPCR)
Mol. Mass.:52868.96
Organism:Homo sapiens (Human)
Description:P21554
Residue:472
BDBM50416464
NameBDBM50416464
Synonyms:CHEMBL1209574
TypeSmall organic molecule
Emp. Form.C23H31N3O2
Mol. Mass.381.5111
SMILESCCN1CCN(CC1)C(=O)c1cn2[C@H](COc3cccc1c23)C1CCCCC1