Reaction Details
TargetDNA repair protein RAD51 homolog 1
LigandBDBM50416564
Substrate/Competitorn/a
Meas. Tech.ChEMBL_649584 (CHEMBL1219282)
IC50 6000±n/a nM
Citation Nomme, JRenodon-Cornière, AAsanomi, YSakaguchi, KStasiak, AZStasiak, ANorden, BTran, VTakahashi, M Design of potent inhibitors of human RAD51 recombinase based on BRC motifs of BRCA2 protein: modeling and experimental validation of a chimera peptide. J Med Chem53:5782-91 (2010) 
 
DNA repair protein RAD51 homolog 1
Name:DNA repair protein RAD51 homolog 1
Type:Enzyme Catalytic Domain
Mol. Mass.:36960.74
Organism:Homo sapiens (Human)
Description:gi_49168602
Residue:339
BDBM50416564
NameBDBM50416564
Synonyms:CHEMBL1215813
TypeSmall organic molecule
Emp. Form.C121H201N33O33
Mol. Mass.2646.0919
SMILESCC[C@H](C)[C@H](NC(=O)[C@H](CCCCN)NC(=O)[C@@H](NC(=O)[C@H](CCCCN)NC(=O)[C@H](CCCCN)NC(=O)CNC(=O)[C@H](CO)NC(=O)[C@H](C)NC(=O)[C@@H](NC(=O)[C@H](Cc1cnc[nH]1)NC(=O)[C@H](Cc1ccccc1)NC(=O)CN)[C@@H](C)O)C(C)C)C(=O)N[C@@H](C)C(=O)N[C@@H](CCCCN)C(=O)N[C@@H](CCC(O)=O)C(=O)N[C@@H](CO)C(=O)N[C@@H](CC(C)C)C(=O)N[C@@H](CC(O)=O)C(=O)N[C@@H](CCCCN)C(=O)N[C@@H](C(C)C)C(=O)N[C@@H](CCCCN)C(=O)N[C@@H](CC(N)=O)C(=O)N[C@@H](CC(C)C)C(=O)N[C@@H](Cc1ccccc1)C(O)=O