Reaction Details
TargetMuscarinic acetylcholine receptor M3
LigandBDBM50416732
Substrate/Competitorn/a
Meas. Tech.ChEMBL_652865 (CHEMBL1226068)
EC50 79.43±n/a nM
Citation Johnson, DJForbes, ITWatson, SPGarzya, VStevenson, GIWalker, GRMudhar, HSFlynn, STWyman, PASmith, PWMurkitt, GSLucas, AJMookherjee, CRWatson, JMGartlon, JEBradford, AMBrown, F The discovery of a series of N-substituted 3-(4-piperidinyl)-1,3-benzoxazolinones and oxindoles as highly brain penetrant, selective muscarinic M1 agonists. Bioorg Med Chem Lett20:5434-8 (2010) 
 
Muscarinic acetylcholine receptor M3
Name:Muscarinic acetylcholine receptor M3
Type:Enzyme
Mol. Mass.:66151.03
Organism:Homo sapiens (Human)
Description:P20309
Residue:590
BDBM50416732
NameBDBM50416732
Synonyms:CHEMBL1223754
TypeSmall organic molecule
Emp. Form.C23H34FN3O2
Mol. Mass.403.5334
SMILESCCCO[C@H]1CC[C@@](C)(CC1)N1CCC(CC1)n1c2cc(C)c(F)cc2[nH]c1=O