Reaction Details
TargetMuscarinic acetylcholine receptor M5
LigandBDBM50416738
Substrate/Competitorn/a
Meas. Tech.ChEMBL_652867 (CHEMBL1226070)
EC50 50.12±n/a nM
Citation Johnson, DJForbes, ITWatson, SPGarzya, VStevenson, GIWalker, GRMudhar, HSFlynn, STWyman, PASmith, PWMurkitt, GSLucas, AJMookherjee, CRWatson, JMGartlon, JEBradford, AMBrown, F The discovery of a series of N-substituted 3-(4-piperidinyl)-1,3-benzoxazolinones and oxindoles as highly brain penetrant, selective muscarinic M1 agonists. Bioorg Med Chem Lett20:5434-8 (2010) 
 
Muscarinic acetylcholine receptor M5
Name:Muscarinic acetylcholine receptor M5
Type:PROTEIN
Mol. Mass.:60102.35
Organism:Homo sapiens (Human)
Description:ChEMBL_1517990
Residue:532
BDBM50416738
NameBDBM50416738
Synonyms:CHEMBL1223860
TypeSmall organic molecule
Emp. Form.C22H31FN2O3
Mol. Mass.390.4915
SMILESCCO[C@H]1CC[C@@](C)(CC1)N1CCC(CC1)n1c2cc(C)c(F)cc2oc1=O