Reaction Details
TargetMuscarinic acetylcholine receptor M4
LigandBDBM50416739
Substrate/Competitorn/a
Meas. Tech.ChEMBL_652866 (CHEMBL1226069)
EC50 200±n/a nM
Citation Johnson, DJForbes, ITWatson, SPGarzya, VStevenson, GIWalker, GRMudhar, HSFlynn, STWyman, PASmith, PWMurkitt, GSLucas, AJMookherjee, CRWatson, JMGartlon, JEBradford, AMBrown, F The discovery of a series of N-substituted 3-(4-piperidinyl)-1,3-benzoxazolinones and oxindoles as highly brain penetrant, selective muscarinic M1 agonists. Bioorg Med Chem Lett20:5434-8 (2010) 
 
Muscarinic acetylcholine receptor M4
Name:Muscarinic acetylcholine receptor M4
Type:Enzyme Catalytic Domain
Mol. Mass.:53079.31
Organism:Homo sapiens (Human)
Description:Cholinergic, muscarinic M4 CHRM4 HUMAN M3::P08173
Residue:479
BDBM50416739
NameBDBM50416739
Synonyms:CHEMBL1223861
TypeSmall organic molecule
Emp. Form.C22H31FN2O3
Mol. Mass.390.4915
SMILESCCO[C@H]1CC[C@@](C)(CC1)N1CCC(CC1)n1c2cc(C)cc(F)c2oc1=O