Reaction Details
TargetAlpha-1B adrenergic receptor
LigandBDBM50416775
Substrate/Competitorn/a
Meas. Tech.ChEMBL_658238 (CHEMBL1246630)
Ki 9.33±n/a nM
Citation Franchini, SPrandi, ABaraldi, ASorbi, CTait, ABuccioni, MMarucci, GCilia, APirona, LFossa, PCichero, EBrasili, L 1,3-Dioxolane-based ligands incorporating a lactam or imide moiety: structure-affinity/activity relationship at alpha1-adrenoceptor subtypes and at 5-HT1A receptors. Eur J Med Chem45:3740-51 (2010) 
 
Alpha-1B adrenergic receptor
Name:Alpha-1B adrenergic receptor
Type:Enzyme
Mol. Mass.:56862.13
Organism:Homo sapiens (Human)
Description:P35368
Residue:520
BDBM50416775
NameBDBM50416775
Synonyms:CHEMBL1242912
TypeSmall organic molecule
Emp. Form.C31H39N3O5
Mol. Mass.533.6585
SMILESCOc1ccccc1N1CCN(C[C@H]2CO[C@](CN3C(=O)CC4(CCCC4)CC3=O)(O2)c2ccccc2)CC1