Reaction Details
TargetAlpha-1D adrenergic receptor
LigandBDBM50416780
Substrate/Competitorn/a
Meas. Tech.ChEMBL_658239 (CHEMBL1246631)
Ki 1.48±n/a nM
Citation Franchini, SPrandi, ABaraldi, ASorbi, CTait, ABuccioni, MMarucci, GCilia, APirona, LFossa, PCichero, EBrasili, L 1,3-Dioxolane-based ligands incorporating a lactam or imide moiety: structure-affinity/activity relationship at alpha1-adrenoceptor subtypes and at 5-HT1A receptors. Eur J Med Chem45:3740-51 (2010) 
 
Alpha-1D adrenergic receptor
Name:Alpha-1D adrenergic receptor
Type:Enzyme Catalytic Domain
Mol. Mass.:60485.82
Organism:Homo sapiens (Human)
Description:adrenergic Alpha1D ADRA1D HUMAN::P25100
Residue:572
BDBM50416780
NameBDBM50416780
Synonyms:CHEMBL1242542
TypeSmall organic molecule
Emp. Form.C27H35N3O4
Mol. Mass.465.5845
SMILESCOc1ccccc1N1CCN(C[C@@H]2CO[C@](CN3CCCCC3=O)(O2)c2ccccc2)CC1